Примечания к релизу Axiom JDK 11.0.16+8

Данный релиз соответствует OpenJDK 11.0.16+8, номер версии Axiom JDK - 11

Axiom JDK 11.0.16+8

Axiom является сертифицированным Java SE 11-совместимым дистрибутивом OpenJDK 11, который работает на серверах (Linux x86_64, Linux ARM64, Solaris SPARC, Solaris x64, Windows 64), настольных компьютерах (Windows 64, Windows 32, Mac, Linux x86_64) и встроенных устройствах (Linux ARM64, Linux ARMv7, включая Raspberry Pi 2 & 3 (ARMv6 hardfloat)). Axiom JDK имеет следующие дополнения:

  • Версия для Linux x86_64 содержит экспериментальную поддержку ZGC.
  • В версии для Linux x86_64, ARMv8 и ARMv7 можно выбрать клиентскую виртуальную машину (Client VM), серверную виртуальную машину (Server VM) и минимальную виртуальную машину (Minimal VM).
  • Версия для Alpine Linux x86_64 построена с поддержкой musl.
  • Версии для Windows x86_64, Windows x86, Windows ARMv8, Mac, Linux x86_64, Linux x86 и Linux ARMv7 содержат OpenJFX 11.
  • Версия для Linux ARMv7 содержит Device IO API, скомпилированный для Raspberry Pi.

Пожалуйста, прочитайте примечания к релизу Oracle JDK 11.0.16 для получения дополнительной информации о функционале JDK 11. В этом документе описываются особенности дистрибутива Axiom по сравнению с дистрибутивом Oracle JDK 11.

Поддерживаемые серверные и десктопные конфигурации

Axiom поддерживается в следующих ОС:

  • Ubuntu Linux 16.04, 18.04 (x86, x86_64, ARMv8)
  • Debian Linux 8, 9 (x86, x86_64, ARMv8)
  • Red Hat, Oracle Linux, CentOS 6.x, 7.x (x86, x86_64, ARMv8)
  • Alpine Linux 3.7+
  • SUSE Linux Enterprise 12, 15, tumbleweed (x86_64, ARMv8)
  • Apple macOS 10.11+
  • Solaris 11.1+ (SPARC, x64)
  • Microsoft Windows 2019, Windows 2016, Windows 2012 R2, Windows 10, Windows 8, Windows 7 (32 bit, 64 bit)

Также известно, Axiom JDK работает с некоторыми другими дистрибутивами Linux и версиями Windows.

Примечание: Минимальная поддерживаемая версия ядра Linux - 2.6.18, версия GLIBC - 2.6. AxiomFX работает на всех поддерживаемых версиях Ubuntu, семействе Red Hat Linux начиная с версии 7.x и SUSE с бэкэндом GTK2.

Поддерживаемые конфигурации для встраиваемых применений

Axiom протестирована и сертифицирована для Raspberry Pi 2 & 3 для следующих операционных систем:

  * Raspbian OS (armhf)   * OpenSUSE (armv8)

Также Axiom JDK работает на Debian (armhf) и Ubuntu (armhf).

Поставка Axiom JDK 11

Axiom JDK 11.0.16 распространяется в виде .msi, .dmg, .deb, .rpm, .zip и .tar.gz. Пожалуйста, выберите формат, который наиболее подходит для ваших целей.

Axiom 11 содержит весь функционал, поддерживаемый OpenJDK 11.

С появлением Jigsaw в JDK 9 и минимальной виртуальной машины (Minimal VM) теперь можно создать среду исполнения, достаточную для запуска приложения и в то же время оптимизированную по размеру. Чтобы создать среду выполнения только с минимальной виртуальной машиной, добавьте опцию - vm=minimal jlink.

По умолчанию Axiom использует серверную виртуальную машину (Server VM). Серверная виртуальная машина и клиентская виртуальная машина могут быть включены с помощью параметров командной строки -server и -client соответственно. В случае, если требуется минимальный размер среды исполенения, можно использовать Minimal VM, которая оптимизирована по размеру. Minimal VM имеет только компилятор C1 JIT, Serial GC и не имеет функционала Serviceability. Minimal VM можно включить параметром командной строки -minimal.

AxiomFX

Axiom JDK 11 поставляется в комплекте со сборкой платформы AxiomFX, основанной на OpenJFX. В следующих таблицах перечислены состояния модулей Java FX дистрибутива Axiom.

  • Java FX Graphics - поддерживается.
  • Java FX Controls - поддерживается.
  • Java FX Media - поддерживается*.
  • Java FX Webkit - поддерживается*.

* - за исключением сборок для armhf.

Для armhf работают следующие графические конвейеры: EGL, SW (direct framebuffer) и GTK. По умолчанию Axiom пытается использовать конвейер EGL, который требует наличия библиотек EGL. Если они не найдены, реализация возвращается к программному обеспечению.

Используйте следующие параметры командной строки, чтобы указать конвейер рендеринга:

  • -Dprism.order=sw - программный конвейер рендеринга.
  • -Dprism.order=es2 - EGL-конвейер и аппаратное ускорение.
  • -Djavafx.platform=gtk, если вы хотите запустить приложение AxiomFX, используя Axiom из X11.

Дополнительная информация доступна на следующей wiki странице.

Device IO API для Raspberry Pi

Axiom JDK 11 для armhf поставляется со встроенным модулем реализации API ввода-вывода (DIO) устройства OpenJDK. DIO предоставляет Java API для доступа к выводам Raspberry PI GPIO и для связи с периферийными устройствами:

  • Универсальный ввод / вывод (GPIO).
  • Межинтегральная шина (I2C), последовательный интерфейс (SPI).
  • Универсальный асинхронный приемник / передатчик (UART).

Дополнительная информация доступна на следующей wiki странице.

Известные особенности

AxiomFX и EGL на ОС Raspbian

С 2017 года в Raspbian OS изменилось расположение бибилитек libEGL.so и libGLESv2.so для чипа Broadcom. Если вы хотите использовать аппаратное ускорение EGL, доступное в видеодрайверах Broadcom в AxiomFX, при работе в Raspbian OS, выполните следующую команду:

cd /opt/vc/lib
sudo ln -s libbrcmEGL.so libEGL.so
sudo ln -s libbrcmGLESv2.so libGLESv2.so

Безопасность

БЕЛЛСОФТ Axiom содержит исправления уязвимостей Oracle Java SE. Пожалуйста, обратитесь к документации Oracle для получения деталей о проблемах, исправленных в данной версии.

Дефекты, исправленные в этом релизе

Issue Description
8284370 Improve zlib usage
8272243 Improve DER parsing
8281866 Enhance MethodHandle invocations
8285407 Improve Xalan supports
8283190 Improve MIDI processing
8281859 Improve class compilation
8272249 Better properties of loaded Properties
8277608 Address IP Addressing
8278346 java/nio/file/Files/probeContentType/Basic.java fails on Linux SLES15 machine
8285515 (dc) DatagramChannel.disconnect fails with “Invalid argument” on macOS 12.4
8287109 Distrust.java failed with CertificateExpiredException
8286855 javac error on invalid jar should only print filename
8286594 (zipfs) Mention paths with dot elements in ZipException and cleanups
8286444 javac errors after JDK-8251329 are not helpful enough to find root cause
8287378 GHA: Update cygwin to fix issues in langtools tests on Windows
8287739 [11u] ProblemList sun/security/ssl/SSLSessionImpl/NoInvalidateSocketException.java
8240132 ProblemList com/sun/jdi/InvokeHangTest.java
8274171 java/nio/file/Files/probeContentType/Basic.java failed on “Content type” mismatches
8285720 test/jdk/java/nio/file/Files/probeContentType/Basic.java fails to compile after backport of 8273655
8284094 Memory leak in invoker_completeInvokeRequest()
8287362 FieldAccessWatch testcase failed on AIX platform
8285397 JNI exception pending in CUPSfuncs.c:250
8181571 printing to CUPS fails on mac sandbox app
8282422 JTable.print() failed with UnsupportedCharsetException on AIX ko_KR locale
8231454 File lock in Windows on a loaded jar due to a leak in Introspector::getBeanInfo
8222799 java.beans.Introspector uses an obsolete methods cache
8287119 Add Distrust.java to ProblemList
8139046 Compiler Control: IGVPrintLevel directive should set PrintIdealGraph
8139173 [macosx] JInternalFrame shadow is not properly drawn
7124301 [macosx] When in a tab group if you arrow between tabs there are no VoiceOver announcements.
8209776 Refactor jdk/security/JavaDotSecurity/ifdefs.sh to plain java test
7124293 [macosx] VoiceOver reads percentages rather than the actual values for sliders.
8214275 CondyRepeatFailedResolution asserts “Dynamic constant has no fixed basic type”
8133713 [macosx] Accessible JTables always reported as empty
8286293 Tests ShortResponseBody and ShortResponseBodyWithRetry should use less resources
8285523 Improve test java/io/FileOutputStream/OpenNUL.java
8280684 JfrRecorderService failes with guarantee(num_written > 0) when no space left on device.
8240756 [macos] SwingSet2:TableDemo:Printed Japanese characters were garbled
8283469 Don’t use memset to initialize members in FileMapInfo and fix memory leak
8234608 [TESTBUG] Fix G1 redefineClasses tests and a memory leak
8264179 [TESTBUG] Some compiler tests fail when running without C2
8163498 Many long-running security libs tests
8209920 runtime/logging/RedefineClasses.java fail with OOME with ZGC
8209150 [TESTBUG] Add logging to verify JDK-8197901 to a different test
8285686 Update FreeType to 2.12.0
8235220 ClhsdbScanOops.java fails with sun.jvm.hotspot.types.WrongTypeException
8227389 Remove unsupported xlc16 compile options on aix
8282008 Incorrect handling of quoted arguments in ProcessBuilder
8285726 [11u, 17u] Unify fix for JDK-8284548 with version from head
8285727 [11u, 17u] Unify fix for JDK-8284920 with version from head
8268773 Improvements related to: Failed to start thread - pthread_create failed (EAGAIN)
8283323 libharfbuzz optimization level results in extreme build times
8286630 [11] avoid -std=c++11 CXX harfbuzz buildflag on Windows
8286198 [linux] Fix process-memory information
8285828 runtime/execstack/TestCheckJDK.java fails with zipped debug symbols
8282293 Domain value for system property jdk.https.negotiate.cbt should be case-insensitive
8255787 Tag container tests that use cGroups with cgroups keyword
8279842 HTTPS Channel Binding support for Java GSS/Kerberos
8206187 javax/management/remote/mandatory/connection/DefaultAgentFilterTest.java fails with Port already in use
8286013 Incorrect test configurations for compiler/stable/TestStableShort.java
8217017 [TESTBUG] Tests fail to compile after JDK-8216265
8284549 JFR: FieldTable leaks FieldInfoTable member
8284620 CodeBuffer may leak _overflow_arena
8279529 ProblemList java/nio/channels/DatagramChannel/ManySourcesAndTargets.java on macosx-aarch64
8279532 ProblemList sun/security/ssl/SSLSessionImpl/NoInvalidateSocketException.java
8280964 [Linux aarch64] : drawImage dithers TYPE_BYTE_INDEXED images incorrectly
8216265 [testbug] Introduce Platform.sharedLibraryPathVariableName() and adapt all tests.
8262379 Add regression test for JDK-8257746
8279505 Update documentation for RETRY_COUNT and REPEAT_COUNT
8274735 javax.imageio.IIOException: Unsupported Image Type while processing a valid JPEG image
8284102 [TESTBUG] [11u] Retroactively add regression test for JDK-8272124
8254001 [Metrics] Enhance parsing of cgroup interface files for version detection
8284458 CodeHeapState::aggregate() leaks blob_name
8277396 [TESTBUG] In DefaultButtonModelCrashTest.java, frame is accessed from main thread
8272167 AbsPathsInImage.java should skip *.dSYM directories
8269772 [macos-aarch64] test compilation failed with “SocketException: No buffer space available”
8266318 Switch to macos prefix for macOS bundles
8242538 java/security/SecureRandom/ThreadSafe.java failed on windows
8233551 [TESTBUG] SelectEditTableCell.java fails on MacOS
8234382 Test tools/javac/processing/model/testgetallmembers/Main.java using too small heap
8279520 SPNEGO has not passed channel binding info into the underlying mechanism
8213440 Lingering INCLUDE_ALL_GCS in test_oopStorage_parperf.cpp
8211795 ArrayIndexOutOfBoundsException in PNGImageReader after JDK-6788458
8169004 Fix redundant @requires tags in tests
8281811 assert(_base == Tuple) failed: Not a Tuple after JDK-8280799
8283834 Unmappable character for US-ASCII encoding in TestPredicateInputBelowLoopPredicate
8280799 РЎ2: assert(false) failed: cyclic dependency prevents range check elimination
8285591 [11] add signum checks in DSA.java engineVerify
8271199 Mutual TLS handshake fails signing client certificate with custom sensitive PKCS11 key
8263718 unused-result warning happens at os_linux.cpp
8285445 cannot open file “NUL:”
8284622 Update versions of some Github Actions used in JDK workflow
8285395 [JVMCI] [11u] Partial backport of JDK-8220623: InstalledCode
8284033 Leak XVisualInfo in getAllConfigs in awt_GraphicsEnv.c
8282231 x86-32: runtime call to SharedRuntime::ldiv corrupts registers
8227171 provide function names in native stack trace on aix with xlc16
8253797 [cgroups v2] Account for the fact that swap accounting is disabled on some systems
8284756 [11u] Remove unused isUseContainerSupport in CgroupV1Subsystem
8281274 deal with ActiveProcessorCount in os::Linux::print_container_info
8217233 Update build settings for AIX/xlc
8203238 [TESTBUG] rewrite MemOptions shell test in Java
8203239 [TESTBUG] remove vmTestbase/vm/gc/kind/parOld test
8208207 Test nsk/stress/jni/gclocker/gcl001 fails after co-location
8220658 Improve the readability of container information in the error log
8284507 GHA: Only check test results if testing was not skipped
8284604 [11u] Update Boot JDK used in GHA to 11.0.14.1
8284389 Improve stability of GHA Pre-submit testing by caching cygwin installer
8218136 minor hotspot adjustments for xlclang++ from xlc16 on AIX
8248876 LoadObject with bad base address created for exec file on linux
8275330 C2: assert(n->is_Root() || n->is_Region() || n->is_Phi() || n->is_MachMerge() || def_block->dominates(block)) failed: uses must be dominated by definitions
8283217 Leak FcObjectSet in getFontConfigLocations() in fontpath.c
8284369 TestFailedAllocationBadGraph fails with -XX:TieredStopAtLevel < 4
8284573 [11u] ProblemList TestBubbleUpRef.java and TestGCOldWithCMS.java because of 8272195
8244602 Add JTREG_REPEAT_COUNT to repeat execution of a test
8242312 use reproducible random in hotspot gc tests
8283641 Large value for CompileThresholdScaling causes assert
8280373 Update Xalan serializer / SystemIDResolver to align with JDK-8270492
8283408 Fix a C2 crash when filling arrays with unsafe
8283451 C2: assert(_base == Long) failed: Not a Long
8272493 Suboptimal code generation around Preconditions.checkIndex intrinsic with AVX2
8282312 Minor corrections to evbroadcasti32x4 intrinsic on x86
8282172 CompileBroker::log_metaspace_failure is called from non-Java/compiler threads
8271055 Crash during deoptimization with “assert(bb->is_reachable()) failed: getting result from unreachable basicblock” with -XX:+VerifyStack
8265297 javax/net/ssl/SSLSession/TestEnabledProtocols.java failed with “RuntimeException: java.net.SocketException: Connection reset”
8229210 [TESTBUG] Move gc stress tests from JFR directory tree to gc/stress
8273655 content-types.properties files are missing some common types
8283350 (tz) Update Timezone Data to 2022a
8218965 aix: support xlclang++ in the compiler detection
8253939 [TESTBUG] Increase coverage of the cgroups detection code
8278794 Infinite loop in DeflaterOutputStream.finish()
8279219 [REDO] C2 crash when allocating array of size too large
8245543 Cgroups: Incorrect detection logic on some systems (still reproducible)
8280867 Cpuid1Ecx feature parsing is incorrect for AMD CPUs
8275337 C1: assert(false) failed: live_in set of first block must be empty
8277093 Vector should throw ClassNotFoundException for a missing class of an element
8272358 Some tests may fail when executed with other locales than the US
8272908 Missing coverage for certain classes in com.sun.org.apache.xml.internal.security
8272964 java/nio/file/Files/InterruptCopy.java fails with java.lang.RuntimeException: Copy was not interrupted
8256146 Cleanup test/jdk/java/nio/channels/DatagramChannel/Connect.java
8254887 C2: assert(cl->trip_count() > 0) failed: peeling a fully unrolled loop
8243429 use reproducible random in :vmTestbase_nsk_stress
8240335 C2: assert(found_sfpt) failed: no node in loop that’s not input to safepoint
8220813 update hotspot tier1_gc tests depending on GC to use @requires vm.gc.X
8282382 Report glibc malloc tunables in error reports
8253435 Cgroup: ‘stomping of _mount_path’ crash if manually mounted cpusets exist
8252359 HotSpot Not Identifying it is Running in a Container
8282887 Potential memory leak in sun.util.locale.provider.HostLocaleProviderAdapterImpl.getNumberPattern() on Windows
8278951 containers/cgroup/PlainRead.java fails on Ubuntu 21.10
8283497 [windows] print TMP and TEMP in hs_err and VM.info
8270797 ShortECDSA.java test is not complete
8255604 java/nio/channels/DatagramChannel/Connect.java fails with java.net.BindException: Cannot assign requested address: connect
8247614 java/nio/channels/DatagramChannel/Connect.java timed out
8253872 ArgumentHandler must use the same delimiters as in jvmti_tools.cpp
8252117 com/sun/jdi/BadHandshakeTest.java failed with “ConnectException: Connection refused: connect”
8192057 com/sun/jdi/BadHandshakeTest.java fails with java.net.ConnectException
8214799 Add package declaration to each JTREG test case in the gc folder
8235385 Crash on aarch64 JDK due to long offset
8278065 Refactor subclassAudits to use ClassValue
8280041 Retry loop issues in java.io.ClassCache
8277072 ObjectStreamClass caches keep ClassLoaders alive
8249592 Robot.mouseMove moves cursor to incorrect location when display scale varies and Java runs in DPI Unaware mode
8239559 Cgroups: Incorrect detection logic on some systems
8279958 Provide configure hints for Alpine/apk package managers
8277922 Unable to click JCheckBox in JTable through Java Access Bridge
8255266 Update Public Suffix List to 3c213aa
8258795 Update IANA Language Subtag Registry to Version 2021-05-11
8247589 Implementation of Alpine Linux/x64 Port
8247591 Document Alpine Linux build steps in OpenJDK build guide
8210732 remove jdk.testlibrary.Utils
8240189 [TESTBUG] Some cgroup tests are failing after JDK-8231111
8259517 Incorrect test path in test cases
8182404 remove jdk.testlibrary.JDKToolFinder and JDKToolLauncher
8210112 remove jdk.testlibrary.ProcessTools
8273176 handle latest VS2019 in abstract_vm_version
8276657 XSLT compiler tries to define a class with empty name
8244500 jtreg test error in test/hotspot/jtreg/containers/docker/TestMemoryAwareness.java
8266391 Replace use of reflection in jdk.internal.platform.Metrics
8252957 Wrong comment in CgroupV1Subsystem::cpu_quota
8254997 Remove unimplemented OSContainer::read_memory_limit_in_bytes
8239785 Cgroups: Incorrect detection logic on old systems in hotspot
8256722 handle VC++:1927 VS2019 in abstract_vm_version
8274751 Drag And Drop hangs on Windows
6986863 ProfileDeferralMgr throwing ConcurrentModificationException
8282583 Update BCEL md to include the copyright notice
8281275 Upgrading from 8 to 11 no longer accepts ‘/’ as filepath separator in gc paths
8278472 Invalid value set to CANDIDATEFORM structure
8242311 use reproducible random in hotspot runtime tests
8242313 use reproducible random in hotspot svc tests
8242310 use reproducible random in hotspot compiler tests
8283614 [11] Repair compiler versions handling after 8233787
8253727 [cgroups v2] Memory and swap limits reported incorrectly
8237479 8230305 causes slowdebug build failure
8253714 [cgroups v2] Soft memory limit incorrectly using memory.high
8231111 Cgroups v2: Rework Metrics in java.base so as to recognize unified hierarchy
8230305 Cgroups v2: Container awareness
8229202 Docker reporting causes secondary crashes in error handling
8216366 Add rationale to PER_CPU_SHARES define
8266545 8261169 broke Harfbuzz build with gcc 7 and 8
8261169 Upgrade HarfBuzz to the latest 2.8.0
8193682 Infinite loop in ZipOutputStream.close()
8278851 Correct signer logic for jars signed with multiple digestalgs
8222926 Shenandoah build fails with –with-jvm-features=-compiler1
8243666 ModuleHashes attribute generated for JMOD and JAR files depends on timestamps
8265261 java/nio/file/Files/InterruptCopy.java fails with java.lang.RuntimeException: Copy was not interrupted
8206330 Revisit com/sun/jdi/RedefineCrossEvent.java
8283420 [AOT] Exclude TrackedFlagTest/NotTrackedFlagTest in 11u because of intermittent java.lang.AssertionError: duplicate classes for name Ljava/lang/Boolean;
8209883 ZGC: Compile without C1 broken
8283424 compiler/loopopts/LoopUnswitchingBadNodeBudget.java fails with release VMs due to lack of -XX:+UnlockDiagnosticVMOptions
8263364 sun/net/www/http/KeepAliveStream/KeepAliveStreamCloseWithWrongContentLength.java wedged in getInputStream
8246494 introduce vm.flagless at-requires property
8210108 sun/tools/jstatd test build failures after JDK-8210022
8210649 AssertionError @ jdk.compiler/com.sun.tools.javac.comp.Modules.enter(Modules.java:244)
8240734 ModuleHashes attribute not reproducible between builds
8230865 [TESTBUG] jdk/jfr/event/io/EvilInstrument.java fails at-run shell MakeJAR.sh target
8217473 SA: Tests using ClhsdbLauncher fail on SAP docker containers
8215544 SA: Modify ClhsdbLauncher to add sudo privileges to enable MacOS tests on Mach5
8278186 org.jcp.xml.dsig.internal.dom.Utils.parseIdFromSameDocumentURI throws StringIndexOutOfBoundsException when calling substring method
8274233 Minor cleanup for ToolBox
8269933 test/jdk/javax/net/ssl/compatibility/JdkInfo incorrect verification of protocol and cipher support
8231489 GC watermark_0_1 failed due to “metaspace.gc.Fault: GC has happened too rare”
8229486 Replace wildcard address with loopback or local host in tests - part 21
8277422 tools/jar/JarEntryTime.java fails with modified time mismatch
8241707 introduce randomness k/w to hotspot test suite
8280476 [macOS] : hotspot arm64 bug exposed by latest clang
8257794 Zero: assert(istate->_stack_limit == istate->_thread->last_Java_sp() + 1) failed: wrong on Linux/x86_32
8223396 [TESTBUG] several jfr tests do not clean up files created in /tmp
8247592 refactor test/jdk/tools/launcher/Test7029048.java
8166727 javac crashed: [jimage.dll+0x1942] ImageStrings::find+0x28
8279356 Method linking fails with guarantee(mh->adapter() != NULL) failed: Adapter blob must already exist!
8199874 [TESTBUG] runtime/Thread/ThreadPriorities.java fails with “expected 0 to equal 10”
8207364 nsk/jvmti/ResourceExhausted/resexhausted003 fails to start
8265343 Update Debian-based cross-compilation recipes
8281615 Deadlock caused by jdwp agent
8266251 compiler.inlining.InlineAccessors shouldn’t do testing in driver VM
8231565 More node budget asserts in fuzzed tests
8229499 Node budget assert in fuzzed test
8234605 C2 failed “assert(C->live_nodes() - live_at_begin <= 2 * _nodes_required) failed: Bad node estimate: actual = 208 » request = 101”
8246741 NetworkInterface/UniqueMacAddressesTest: mac address uniqueness test failed
8211822 Some tests fail after JDK-8210039
8202886 [macos] Test java/awt/MenuBar/8007006/bug8007006.java fails on MacOS
8223389 Shenandoah optimizations fail with assert(!phase->exceeding_node_budget())
8225475 Node budget asserts on x86_32/64
8283018 11u GHA: Update GCC 9 minor versions
8210039 move OSInfo to top level testlibrary
8223363 Bad node estimate assertion failure
8223502 Node estimate for loop unswitching is not correct: assert(delta <= 2 * required) failed: Bad node estimate
8224648 assert(!exceeding_node_budget()) failed: Too many NODES required! failure with ctw
8279668 x86: AVX2 versions of vpxor should be asserted
8186548 move jdk.testlibrary.JcmdBase closer to tests
8210022 remove jdk.testlibrary.ProcessThread, TestThread and XRun
8218751 Do not store original classfiles inside the CDS archive
8282589 runtime/ErrorHandling/ErrorHandler.java fails on MacOS aarch64 in jdk 11
8208697 vmTestbase/metaspace/stressHierarchy/stressHierarchy012/TestDescription.java fails with OutOfMemoryError: Metaspace
8212151 jdi/ExclusiveBind.java times out due to “bind failed: Address already in use” on Solaris-X64
8216137 assert(Compile::current()->live_nodes() < Compile::current()->max_node_limit()) failed: Live Node limit exceeded limit
8282225 GHA: Allow one concurrent run per PR only
8217340 Compilation failed: tools/launcher/Test7029048.java
8245938 Remove unused print_stack(void) method from XToolkit.c
8252248 __SIGRTMAX is not declared in musl libc
8252250 isnanf is obsolete
8258956 Memory Leak in StringCoding on ThreadLocal resultCached StringCoding.Result
8211962 Implicit narrowing in MacOSX java.desktop jsound
8223143 Restructure/clean-up for ‘loopexit_or_null()’.
8208249 TriggerUnloadingByFillingMetaspace generates garbage class names
8279837 C2: assert(is_Loop()) failed: invalid node class: Region
8208246 flags duplications in vmTestbase_vm_g1classunloading tests
8275082 Update XML Security for Java to 2.3.0
8276990 Memory leak in invoker.c fillInvokeRequest() during JDI operations
8282588 [11] set harfbuzz compilation flag to -std=c++11
8263856 Github Actions for macos/aarch64 cross-build
8260518 Change default -mmacosx-version-min to 10.12
8282501 Bump update version for OpenJDK: jdk-11.0.16
8286256 Update libxml2 to 2.9.14 8286257: Update libxslt to 1.1.35
8285152 Change JavaFX release version to 11.0.16 in jfx11u
8284184 Crash in GraphicsContextJava::drawLinesForText on https://us.yahoo.com/
8283869 Update attribution in webkit.md file
8283328 Update libxml2 to 2.9.13
8283218 Update GStreamer to 1.20.1 8283403: Update Glib to 2.72.0
8282134 Certain regex can cause a JS trap in WebView
8281564 Update cmake to 3.22.3
8280841 Update SQLite to 3.37.2
8280840 Update libFFI to 3.4.2
8280275 JUnit5 tests using Assumptions API fail to compile in some cases
8280020 Underline and line-through not straight in WebView
8278759 PointerEvent: buttons property set to 0 when mouse down
8276174 JavaFX build fails on macOS aarch64
8276142 Update gradle to version 7.3
8274274 Update JUnit to version 5.8.1
8273998 Clarify specification for Window properties controlled by the window manager
8270867 Debug build of WebKit 613.1 fails on Linux
8269115 WebView paste event contains old data
8255940 localStorage is null after window.close()
Обратно на страницу загрузки
ООО БЕЛЛСОФТ info@axiomjdk.ru ООО БЕЛЛСОФТ logo Axiom Committed to Freedom 199 Obvodnogo Kanala Emb. 190020 St. Petersburg RU +7 812-336-35-67 ООО БЕЛЛСОФТ 199 Obvodnogo Kanala Emb. 190020 St. Petersburg RU +7 812-336-35-67 ООО БЕЛЛСОФТ 111 North Market Street, Suite 300 CA 95113 San Jose US +1 702 213-59-59